Build failure in latest ath10k tree.

Ben Greear greearb at
Wed Feb 26 13:50:10 EST 2014

Looks non-related to ath10k itself...maybe bad merge or
upstream error?

I'll dig into it in a bit if no one beats me to it.

[greearb at ben-dt2 linux-ath.x64]$ make  bzImage modules
make[3]: Nothing to be done for `all'.
make[3]: Nothing to be done for `relocs'.
  CHK     include/config/kernel.release
  Using /mnt/sda/home/greearb/git/linux.ath as source for kernel
  GEN     /home/greearb/kernel/2.6/linux-ath.x64/Makefile
  CHK     include/generated/uapi/linux/version.h
  CHK     include/generated/utsrelease.h
  CALL    /mnt/sda/home/greearb/git/linux.ath/scripts/
  CHK     include/generated/compile.h
  CC      arch/x86/kernel/cpu/capflags.o
  CC      arch/x86/kernel/cpu/common.o
fixdep: error opening config file: /mnt/sda/home/greearb/git/linux.ath/include/linux/spinlokk_types.h: No such file or directory
make[5]: *** [arch/x86/kernel/cpu/common.o] Error 2
make[4]: *** [arch/x86/kernel/cpu] Error 2
make[3]: *** [arch/x86/kernel] Error 2
make[2]: *** [arch/x86] Error 2
make[1]: *** [sub-make] Error 2
make: *** [all] Error 2


Ben Greear <greearb at>
Candela Technologies Inc

More information about the ath10k mailing list