❌ FAIL: Test report for 5.19.0-rc8 (arm-next) [680fb5b0]
cki-project at redhat.com
cki-project at redhat.com
Mon Aug 15 09:50:25 PDT 2022
Hi, we tested your kernel and here are the results:
Overall result: FAILED
Merge: OK
Compile: OK
Test: FAILED
You can find all the details about the test run at
https://datawarehouse.cki-project.org/kcidb/checkouts/50798
One or more kernel tests failed:
Unrecognized or new issues:
aarch64 - selinux-policy: serge-testsuite
Logs: https://datawarehouse.cki-project.org/kcidb/tests/4815077
We also see the following known issues which are not related to your changes:
Issue: stress: stress-ng: fail to build core-affinity: error: redeclaration of enum fsconfig_command
URL: https://gitlab.com/redhat/centos-stream/tests/kernel/kernel-tests/-/issues/1303
Affected tests:
aarch64 - stress: stress-ng - cpu-cache
aarch64 - stress: stress-ng - memory
Issue: Storage - blktests: fail to build mount_clear_sock: error: redeclaration of enum fsconfig_command
URL: https://gitlab.com/redhat/centos-stream/tests/kernel/kernel-tests/-/issues/1300
Affected tests:
aarch64 - Storage - blktests - nvme-tcp
aarch64 - Storage - blktests - nvmeof-mp
Issue: avc: denied { sys_admin } for pid=674004 comm="systemd-gpt-aut" capability=21 scontext=system_u:system_r:systemd_gpt_generator_t:s0 tcontext=system_u:system_r:systemd_gpt_generator_t:s0 tclass=capability permissive=0
URL: https://bugzilla.redhat.com/show_bug.cgi?id=2083900
Affected tests:
aarch64 - Networking cki netfilter test
aarch64 - ALSA PCM loopback test
aarch64 - Storage - SCSI VPD
aarch64 - Storage - software RAID testing
Issue: xfstests: fail to build detached_mounts_propagation: error: redeclaration of 'enum fsconfig_command'
URL: https://gitlab.com/redhat/centos-stream/tests/kernel/kernel-tests/-/issues/1302
Affected tests:
aarch64 - xfstests - ext4
aarch64 - xfstests - xfs
aarch64 - xfstests - btrfs
If you find a failure unrelated to your changes, please tag it at https://datawarehouse.cki-project.org .
This will prevent the failures from being incorrectly reported in the future.
If you don't have permissions to tag an issue, you can contact the CKI team or
test maintainers.
Please reply to this email if you have any questions about the tests that we
ran or if you have any suggestions on how to make future tests more effective.
,-. ,-.
( C ) ( K ) Continuous
`-',-.`-' Kernel
( I ) Integration
`-'
______________________________________________________________________________
More information about the linux-arm-kernel
mailing list